build failed 1.33

Forum for questions and support relating to 1.33.x development only.
Post Reply
xefil
Posts: 15
Joined: Wed Jul 19, 2017 1:30 pm

build failed 1.33

Post by xefil » Tue Feb 05, 2019 3:16 pm

Hello,

I'm trying to build 1.33 packages, but it fails with following output:

Code: Select all

Build finished. The manual pages are in _build/man.
make[2]: Leaving directory '/root/software/zm-1.33.1/zoneminder_1.33.1~20190205155101.orig/docs'
dh_installman --language=C dbuild/scripts/zmupdate.pl.1
make[1]: Leaving directory '/root/software/zm-1.33.1/zoneminder_1.33.1~20190205155101.orig'
   debian/rules override_dh_systemd_enable
make[1]: Entering directory '/root/software/zm-1.33.1/zoneminder_1.33.1~20190205155101.orig'
dh_systemd_enable --no-enable
make[1]: Leaving directory '/root/software/zm-1.33.1/zoneminder_1.33.1~20190205155101.orig'
   dh_installinit -O--parallel -O--buildsystem=cmake -O--builddirectory=dbuild
   debian/rules override_dh_systemd_start
make[1]: Entering directory '/root/software/zm-1.33.1/zoneminder_1.33.1~20190205155101.orig'
dh_systemd_start --no-start
make[1]: Leaving directory '/root/software/zm-1.33.1/zoneminder_1.33.1~20190205155101.orig'
   dh_installlogrotate -O--parallel -O--buildsystem=cmake -O--builddirectory=dbuild
   dh_bugfiles -O--parallel -O--buildsystem=cmake -O--builddirectory=dbuild
   dh_lintian -O--parallel -O--buildsystem=cmake -O--builddirectory=dbuild
   dh_perl -O--parallel -O--buildsystem=cmake -O--builddirectory=dbuild
   dh_link -O--parallel -O--buildsystem=cmake -O--builddirectory=dbuild
   dh_linktree -O--parallel -O--buildsystem=cmake -O--builddirectory=dbuild
   dh_strip_nondeterminism -O--parallel -O--buildsystem=cmake -O--builddirectory=dbuild
Undefined subroutine &main::on_items_in_parallel called at /usr/bin/dh_strip_nondeterminism line 95.
make: *** [debian/rules:15: binary] Error 29
dpkg-buildpackage: error: debian/rules binary gave error exit status 2
debuild: fatal error at line 1182:
dpkg-buildpackage -us -uc -ui -i -b failed
Error status code is: 0
Build failed.
I'm on Debian 'buster/sid':

PRETTY_NAME="Debian GNU/Linux buster/sid"
NAME="Debian GNU/Linux"
ID=debian
HOME_URL="https://www.debian.org/"
SUPPORT_URL="https://www.debian.org/support"
BUG_REPORT_URL="https://bugs.debian.org/"

Ideas?

Thanks, Simon

Post Reply

Who is online

Users browsing this forum: No registered users and 1 guest